Target
E3 ubiquitin-protein ligase Mdm2
Ligand
BDBM129810
Substrate
Meas. Tech.
Time Resolved Fluorescence Energy Transfer (TR-FRET) Assay
IC50
0.04±n/a nM
Citation
 Furet, PGuagnano, VHolzer, PKallen, JLiao, LMah, RMao, LMasuya, KSchlapbach, AStutz, SVaupel, A Substituted pyrrolo[3,4-D]imidazoles for the treatment of MDM2/4 mediated diseases US Patent  US8815926 Publication Date 8/26/2014 
Target
Name:
E3 ubiquitin-protein ligase Mdm2
Synonyms:
Double minute 2 protein E3 ubiquitin-protein ligase Mdm2 (p53-binding protein Mdm2) Human Double Minute 2 (HDM2) MDM2-MDMX p53-Binding Protein MDM2 | p53-binding protein
Type:
Oncoprotein
Mol. Mass.:
55196.54
Organism:
Homo sapiens (Human)
Description:
Q00987
Residue:
491
  
Inhibitor
Name:
BDBM129810
Synonyms:
US8815926, 89
Type:
Small organic molecule
Emp. Form.:
C30H29Cl2N3O3
Mol. Mass.:
550.476
SMILES:
COc1ccc(CO)cc1-c1nc2C(=O)N([C@H](c2n1C(C)C)c1ccc(Cl)cc1C)c1cc(Cl)ccc1C
: