Target
5-hydroxytryptamine receptor 1A
Ligand
BDBM130254
Substrate
Meas. Tech.
Binding Assay
pH
7.4±n/a
IC50
89.8±n/a nM
Comments
extracted
Citation
 Lee, KHYi, HJCho, HIm, DJChae, EHChoi, YJ Carbamoyloxy arylalkan arylpiperazine analgesics US Patent  US8815852 Publication Date 8/26/2014 
Target
Name:
5-hydroxytryptamine receptor 1A
Synonyms:
5-HT-1A 5-HT1A 5-hydroxytryptamine receptor 1A (5HT1A) 5ht1a Htr1a Serotonin 1a (5-HT1a) receptor/Adrenergic receptor alpha-1 | Serotonin receptor 1A
Type:
G Protein-Coupled Receptor (GPCR)
Mol. Mass.:
46445.29
Organism:
Rattus norvegicus (rat)
Description:
Binding assays were performed using rat hippocampal membranes.
Residue:
422
  
Inhibitor
Name:
BDBM130254
Synonyms:
US8815852, 94
Type:
Small organic molecule
Emp. Form.:
C21H27N3O2
Mol. Mass.:
353.458
SMILES:
NC(=O)OC(CCCN1CCN(CC1)c1ccccc1)c1ccccc1
: