Target
5-hydroxytryptamine receptor 2A
Ligand
BDBM130253
Substrate
Meas. Tech.
Binding Assay
pH
7.7±n/a
Temperature
277.15±n/a K
IC50
940±n/a nM
Comments
extracted
Citation
 Lee, KHYi, HJCho, HIm, DJChae, EHChoi, YJ Carbamoyloxy arylalkan arylpiperazine analgesics US Patent  US8815852 Publication Date 8/26/2014 
Target
Name:
5-hydroxytryptamine receptor 2A
Synonyms:
5-HT-2A 5-HT2A 5-hydroxytryptamine receptor 2A (5HT2A) Htr2 Serotonin Receptor 2A
Type:
G Protein-Coupled Receptor (GPCR)
Mol. Mass.:
52852.05
Organism:
Rattus norvegicus (rat)
Description:
Rat cortex membranes 5-HT2A receptors.
Residue:
471
  
Inhibitor
Name:
BDBM130253
Synonyms:
US8815852, 93
Type:
Small organic molecule
Emp. Form.:
C27H29F2N3O2
Mol. Mass.:
465.5349
SMILES:
NC(=O)OC(CCN1CCN(CC1)C(c1ccc(F)cc1)c1ccc(F)cc1)c1ccccc1
: