Target
Dihydrofolate reductase
Ligand
BDBM50448749
Substrate
Meas. Tech.
Inhibition Assay
Ki
1164±n/a nM
Citation
 Chen, ZCreighton, CJCunningham, MFinn, JHilgers, MJung, MKohnen, LALam, TLi, XStidham, MTari, LTrzoss, MZhang, J Dihydrofolate reductase inhibitors US Patent  US8835445 Publication Date 9/16/2014 
Target
Name:
Dihydrofolate reductase
Synonyms:
DHFR Dihydrofolate reductase (DHFR) | Tetrahydrofolate dehydrogenase
Type:
Enzyme
Mol. Mass.:
21453.99
Organism:
Homo sapiens (Human)
Description:
Recombinant human DHFR.
Residue:
187
  
Inhibitor
Name:
BDBM50448749
Synonyms:
CHEMBL3127916 | US8835445, 15
Type:
Small organic molecule
Emp. Form.:
C20H20N6
Mol. Mass.:
344.413
SMILES:
Cc1cc2nc(C3CC3)n(-c3ccc4c(N)nc(N)nc4c3)c2cc1C
: