Target
Dihydrofolate reductase
Ligand
BDBM131857
Substrate
Meas. Tech.
Inhibition Assay
Ki
50.5±n/a nM
Citation
 Chen, ZCreighton, CJCunningham, MFinn, JHilgers, MJung, MKohnen, LALam, TLi, XStidham, MTari, LTrzoss, MZhang, J Dihydrofolate reductase inhibitors US Patent  US8835445 Publication Date 9/16/2014 
Target
Name:
Dihydrofolate reductase
Synonyms:
DHFR Dihydrofolate reductase (DHFR) | Tetrahydrofolate dehydrogenase
Type:
Enzyme
Mol. Mass.:
21453.99
Organism:
Homo sapiens (Human)
Description:
Recombinant human DHFR.
Residue:
187
  
Inhibitor
Name:
BDBM131857
Synonyms:
US8835445, 41
Type:
Small organic molecule
Emp. Form.:
C17H15N5
Mol. Mass.:
289.3345
SMILES:
Cc1cc2c(N)nc(N)nc2cc1-c1c[nH]c2ccccc12
: