Target
Steroid 17-alpha-hydroxylase/17,20 lyase
Ligand
BDBM132131
Substrate
Meas. Tech.
Enzyme Assay
IC50
25±n/a nM
Citation
 Bock, MGGaul, CGunmadi, VRSengupta, S Inhibitors of CYP 17 US Patent  USRE45173 Publication Date 9/30/2014 
Target
Name:
Steroid 17-alpha-hydroxylase/17,20 lyase
Synonyms:
CP17A_HUMAN CYP17A1 Cytochrome P450 17A1 Cytochrome P450 C17 (CYP17) Cytochrome P450-C17 P450-C17 Steroid 17-alpha-Monooxygenase (CYP17) Steroid 17-alpha-monooxygenase | cytochrome P450 monooxygenase 17 alpha hydroxylase/17,20-lyase (CYP17)
Type:
Enzyme
Mol. Mass.:
57382.42
Organism:
Homo sapiens (Human)
Description:
E.coli expressing human CYP17
Residue:
508
  
Inhibitor
Name:
BDBM132131
Synonyms:
USRE45173, 56A
Type:
Small organic molecule
Emp. Form.:
C16H17N3O2
Mol. Mass.:
283.3251
SMILES:
COc1cccc(c1)N1CCN(C1=O)c1cnccc1C
: