Target
cAMP-specific 3',5'-cyclic phosphodiesterase 4D
Ligand
BDBM135821
Substrate
Meas. Tech.
TR-FRET-Based Phosphodiesterase Assay
IC50
206±n/a nM
Citation
 Mjalli, AMGaddam, BPolisetti, DRKostura, MJGuzel, M Tricyclic compounds as modulators of TNF-α synthesis and as PDE4 inhibitors US Patent  US8853226 Publication Date 10/7/2014 
Target
Name:
cAMP-specific 3',5'-cyclic phosphodiesterase 4D
Synonyms:
3',5'-cyclic phosphodiesterase PDE43 PDE4D_HUMAN | Phosphodiesterase 4D
Type:
Protein
Mol. Mass.:
91092.69
Organism:
Homo sapiens (Human)
Description:
Q08499
Residue:
809
  
Inhibitor
Name:
BDBM135821
Synonyms:
US10085990, Example 118 US8853226, 118 US9833457, 118
Type:
Small organic molecule
Emp. Form.:
C23H21ClN4O5S
Mol. Mass.:
500.955
SMILES:
COc1cccc2c1ncc1c2n([C@H]2CCN(C2)S(C)(=O)=O)c(=O)n(-c2cccc(Cl)c2)c1=O
: