Target
Beta-secretase 1
Ligand
BDBM50393102
Substrate
Meas. Tech.
Diluted TR-FRET Assay
pH
9.2±n/a
IC50
0.89±n/a nM
Comments
extracted
Citation
 Csjernyik, GKarlstrom, SKers, AKolmodin, KNylof, MOhberg, LRakos, LSandberg, LSehgelmeble, FSoderman, PSwahn, BVon Berg, S Compounds and their use as BACE inhibitors US Patent  US8865911 Publication Date 10/21/2014 
Target
Name:
Beta-secretase 1
Synonyms:
ASP2 Aspartyl protease 2 BACE1 Beta-secretase (BACE) Beta-secretase 1 (BACE 1) Beta-secretase 1 (BACE1) Beta-site amyloid precursor protein cleaving enzyme 1 Memapsin-2 beta-Secretase (BACE-1) | beta-Secretase (BACE1)
Type:
Protein
Mol. Mass.:
55755.10
Organism:
Homo sapiens (Human)
Description:
P56817
Residue:
501
  
Inhibitor
Name:
BDBM50393102
Synonyms:
CHEMBL2152917 US8865911, 20t US8865911, 20t Isomer 2 | US9918985, Example 20t Isomer 1
Type:
Small organic molecule
Emp. Form.:
C22H31N3O2
Mol. Mass.:
369.5004
SMILES:
CO[C@H]1CC[C@@]2(Cc3ccc(OCC(C)C)cc3C22N=C(C)C(N)=N2)CC1
: