Target
Beta-secretase 1
Ligand
BDBM136799
Substrate
Meas. Tech.
Diluted TR-FRET Assay
pH
9.2±n/a
IC50
0.7±n/a nM
Comments
extracted
Citation
 Csjernyik, GKarlstrom, SKers, AKolmodin, KNylof, MOhberg, LRakos, LSandberg, LSehgelmeble, FSoderman, PSwahn, BVon Berg, S Compounds and their use as BACE inhibitors US Patent  US8865911 Publication Date 10/21/2014 
Target
Name:
Beta-secretase 1
Synonyms:
ASP2 Aspartyl protease 2 BACE1 Beta-secretase (BACE) Beta-secretase 1 (BACE 1) Beta-secretase 1 (BACE1) Beta-site amyloid precursor protein cleaving enzyme 1 Memapsin-2 beta-Secretase (BACE-1) | beta-Secretase (BACE1)
Type:
Protein
Mol. Mass.:
55755.10
Organism:
Homo sapiens (Human)
Description:
P56817
Residue:
501
  
Inhibitor
Name:
BDBM136799
Synonyms:
US8865911, 48 Isomer 1 US8865911, 48 Isomer 5 | US8865911, 48 Isomer 6
Type:
Small organic molecule
Emp. Form.:
C23H24ClN3O2
Mol. Mass.:
409.909
SMILES:
CC1=NC2(CC(Oc3ccc(cc23)-c2cccc(Cl)c2)C2CCCOC2)N=C1N
: