Target
Beta-secretase 1
Ligand
BDBM136859
Substrate
Meas. Tech.
Diluted TR-FRET Assay
pH
9.2±n/a
IC50
5.3±n/a nM
Comments
extracted
Citation
 Csjernyik, GKarlstrom, SKers, AKolmodin, KNylof, MOhberg, LRakos, LSandberg, LSehgelmeble, FSoderman, PSwahn, BVon Berg, S Compounds and their use as BACE inhibitors US Patent  US8865911 Publication Date 10/21/2014 
Target
Name:
Beta-secretase 1
Synonyms:
ASP2 Aspartyl protease 2 BACE1 Beta-secretase (BACE) Beta-secretase 1 (BACE 1) Beta-secretase 1 (BACE1) Beta-site amyloid precursor protein cleaving enzyme 1 Memapsin-2 beta-Secretase (BACE-1) | beta-Secretase (BACE1)
Type:
Protein
Mol. Mass.:
55755.10
Organism:
Homo sapiens (Human)
Description:
P56817
Residue:
501
  
Inhibitor
Name:
BDBM136859
Synonyms:
US10231967, Example 95 US9918985, Example 95
Type:
Small organic molecule
Emp. Form.:
C27H30N4O
Mol. Mass.:
426.5533
SMILES:
CCc1cc(cc(c1)-c1ccc2C[C@@]3(CC[C@@H](CC3)OC)C3(N=C(C)C(N)=N3)c2c1)C#N
: