Target
[Pyruvate dehydrogenase (acetyl-transferring)] kinase isozyme 2, mitochondrial
Ligand
BDBM137977
Substrate
Meas. Tech.
Inhibition Assay
pH
8±n/a
Temperature
303.15±n/a K
IC50
110±n/a nM
Comments
extracted
Citation
 Motomura, TNagamori, HSuzawa, KIto, HMorita, TKobayashi, SShinkai, H Fluorene compound and pharmaceutical use thereof US Patent  US8871934 Publication Date 10/28/2014 
Target
Name:
[Pyruvate dehydrogenase (acetyl-transferring)] kinase isozyme 2, mitochondrial
Synonyms:
PDHK2 PDK2_HUMAN Pyruvate dehydrogenase kinase isoenzyme 1 (PDK2)
Type:
Enzyme
Mol. Mass.:
46153.78
Organism:
Homo sapiens (Human)
Description:
Q15119
Residue:
407
  
Inhibitor
Name:
BDBM137977
Synonyms:
US8871934, 570
Type:
Small organic molecule
Emp. Form.:
C19H15F3N2O2
Mol. Mass.:
360.3298
SMILES:
Cn1cc(cn1)-c1cc2c(-c3ccccc3C2(O)C(F)(F)F)c(CO)c1
: