Target
Sodium-dependent serotonin transporter
Ligand
BDBM138172
Substrate
Meas. Tech.
Binding Assay
Ki
1600±n/a nM
Citation
 Skolnick, PBasile, AChen, ZEpstein, JW 1-aryl-3-azabicyclo[3.1.0]hexanes: preparation and use to treat neuropsychiatric disorders US Patent  US8877798 Publication Date 11/4/2014 
Target
Name:
Sodium-dependent serotonin transporter
Synonyms:
5-HT Transporter 5HT transporter Anandamid membrane transporter, AMT Monoamine transporters; Norepinephrine & serotonin Slc6a4 Sodium-dependent serotonin transporter (SERT) | imipramine receptor
Type:
Multi-pass membrane protein
Mol. Mass.:
70168.43
Organism:
Rattus norvegicus (rat)
Description:
P31652
Residue:
630
  
Inhibitor
Name:
BDBM138172
Synonyms:
US8877798, Table 3, Structure 18
Type:
Small organic molecule
Emp. Form.:
C12H13F2N
Mol. Mass.:
209.2351
SMILES:
CN1CC2CC2(C1)c1ccc(F)c(F)c1
: