Target
Neuronal acetylcholine receptor subunit alpha-7
Ligand
BDBM139020
Substrate
Meas. Tech.
Binding Assay
pH
7.4±n/a
Temperature
277.15±n/a K
Ki
3.7±n/a nM
Comments
extracted
Citation
 Hendrix, MBöβ, FErb, CFleβner, Tvan Kampen, MLuithle, JMethfessel, CWiese, W 2-heteroarylcarboxylic acid amides US Patent  US8884017 Publication Date 11/11/2014 
Target
Name:
Neuronal acetylcholine receptor subunit alpha-7
Synonyms:
ACHA7_HUMAN Cholinergic, Nicotinic Alpha7 Neuronal acetylcholine receptor protein alpha-7 subunit Nicotinic acetylcholine receptor alpha-7 (alpha7 nAChR)
Type:
Mol. Mass.:
56448.33
Organism:
Homo sapiens (Human)
Description:
CHRNA7 (NACHRA7)
Residue:
502
  
Inhibitor
Name:
BDBM139020
Synonyms:
US8884017, 35
Type:
Small organic molecule
Emp. Form.:
C16H19N3O2
Mol. Mass.:
285.341
SMILES:
Nc1ccc2cc(oc2c1)C(=O)N[C@H]1CN2CCC1CC2
: