Target
Serine/threonine-protein kinase PLK1
Ligand
BDBM139107
Substrate
Meas. Tech.
Biochemical Assay
pH
7.9±n/a
IC50
26±n/a nM
Citation
 Caruso, MBeria, IBrasca, MGFerguson, RPosteri, HValsasina, B Substituted pyrazolo-quinazoline derivatives, process for their preparation and their use as kinase inhibitors US Patent  US8614220 Publication Date 12/24/2013 
Target
Name:
Serine/threonine-protein kinase PLK1
Synonyms:
PLK PLK1 Polo-like kinase 1 (PlK1) STPK13 Serine/threonine-protein kinase 13 | polo-like kinase
Type:
Serine/threonine-protein kinase
Mol. Mass.:
68277.16
Organism:
Homo sapiens (Human)
Description:
P53350
Residue:
603
  
Inhibitor
Name:
BDBM139107
Synonyms:
US8614220, A85B1C4Z
Type:
Small organic molecule
Emp. Form.:
C24H30N8O2
Mol. Mass.:
462.5474
SMILES:
CNC(=O)c1nn(C)c-2c1CCc1cnc(Nc3cc(ccc3OC)N3CCN(C)CC3)nc-21
: