Target
3-phosphoinositide-dependent protein kinase 1
Ligand
BDBM139765
Substrate
Meas. Tech.
Kinase Assay
pH
7.5±n/a
IC50
1±n/a nM
Comments
extracted
Citation
 McConnell, DEngelhardt, HKofink, C 1H-imidazo[4,5-c]quinolines US Patent  US8895581 Publication Date 11/25/2014 
Target
Name:
3-phosphoinositide-dependent protein kinase 1
Synonyms:
3-Phosphoinositide-Dependent Protein Kinase 1 (PDK1) 3-phosphoinositide-dependent protein kinase 1 3-phosphoinositide-dependent protein kinase 1 (PDK-1) Isoform 2 of 3-phosphoinositide-dependent protein kinase 1 PDPK1 Phosphoinositide-dependent protein kinase 1 (PDK1) hPDK1
Type:
Enzyme
Mol. Mass.:
63157.65
Organism:
Homo sapiens (Human)
Description:
O15530
Residue:
556
  
Inhibitor
Name:
BDBM139765
Synonyms:
US8895581, I-1
Type:
Small organic molecule
Emp. Form.:
C25H16F2N6O2
Mol. Mass.:
470.4303
SMILES:
Fc1ccc(Cn2cncc(C(=O)NCC#Cc3ccc4ncc5nc[nH]c5c4c3)c2=O)cc1F
: