Target
Interleukin-6
Ligand
BDBM140016
Substrate
Meas. Tech.
Fluorescence Polarization Ligand Binding Assay
IC50
7±n/a nM
Citation
 Rucker, PVSnyder, JS Tricyclic compounds, compositions, and methods US Patent  US8901310 Publication Date 12/2/2014 
Target
Name:
Interleukin-6
Synonyms:
B-cell stimulatory factor 2 CDF Hybridoma growth factor IFNB2 IL6 Interferon beta-2
Type:
Mol. Mass.:
23717.96
Organism:
Homo sapiens (Human)
Description:
P05231
Residue:
212
  
Inhibitor
Name:
BDBM140016
Synonyms:
US8901310, Comparator F
Type:
Small organic molecule
Emp. Form.:
C29H29F3N2O3
Mol. Mass.:
510.5474
SMILES:
Cc1ncccc1NC(=O)c1ccc2c(c1)[C@H](O)C[C@@H]1C[C@](O)(CC[C@@]21Cc1ccccc1)C(F)(F)F
: