Target
Interleukin-6
Ligand
BDBM140014
Substrate
Meas. Tech.
Fluorescence Polarization Ligand Binding Assay
IC50
1.3±n/a nM
Citation
 Rucker, PVSnyder, JS Tricyclic compounds, compositions, and methods US Patent  US8901310 Publication Date 12/2/2014 
Target
Name:
Interleukin-6
Synonyms:
B-cell stimulatory factor 2 CDF Hybridoma growth factor IFNB2 IL6 Interferon beta-2
Type:
Mol. Mass.:
23717.96
Organism:
Homo sapiens (Human)
Description:
P05231
Residue:
212
  
Inhibitor
Name:
BDBM140014
Synonyms:
US8901310, Comparator D
Type:
Small organic molecule
Emp. Form.:
C29H29F3N2O2
Mol. Mass.:
494.548
SMILES:
Cc1ccncc1NC(=O)c1ccc2c(CC[C@@H]3C[C@](O)(CC[C@@]23Cc2ccccc2)C(F)(F)F)c1
: