Target
Glucocorticoid receptor
Ligand
BDBM140009
Substrate
Meas. Tech.
Fluorescence Polarization Ligand Binding Assay
IC50
1.31±n/a nM
Citation
 Rucker, PVSnyder, JS Tricyclic compounds, compositions, and methods US Patent  US8901310 Publication Date 12/2/2014 
Target
Name:
Glucocorticoid receptor
Synonyms:
GCR_HUMAN GRL Glucocorticoid receptor (GRFP) Nuclear receptor subfamily 3 group C member 1
Type:
Enzyme
Mol. Mass.:
85656.87
Organism:
Homo sapiens (Human)
Description:
P04150
Residue:
777
  
Inhibitor
Name:
BDBM140009
Synonyms:
US8901310, Example 1
Type:
Small organic molecule
Emp. Form.:
C29H29F3N2O2
Mol. Mass.:
494.548
SMILES:
Cc1ncccc1NC(=O)c1ccc2c(CC[C@@H]3C[C@](O)(CC[C@@]23Cc2ccccc2)C(F)(F)F)c1
: