Target
Glucocorticoid receptor
Ligand
BDBM140018
Substrate
Meas. Tech.
Fluorescence Polarization Ligand Binding Assay
IC50
8.03±n/a nM
Citation
 Rucker, PVSnyder, JS Tricyclic compounds, compositions, and methods US Patent  US8901310 Publication Date 12/2/2014 
Target
Name:
Glucocorticoid receptor
Synonyms:
GCR_HUMAN GRL Glucocorticoid receptor (GRFP) Nuclear receptor subfamily 3 group C member 1
Type:
Enzyme
Mol. Mass.:
85656.87
Organism:
Homo sapiens (Human)
Description:
P04150
Residue:
777
  
Inhibitor
Name:
BDBM140018
Synonyms:
US8901310, Comparator H
Type:
Small organic molecule
Emp. Form.:
C29H30F2N2O2
Mol. Mass.:
476.5575
SMILES:
Cc1ncccc1NC(=O)c1ccc2c(CC[C@@H]3C[C@](O)(CC[C@@]23Cc2ccccc2)C(F)F)c1
: