Target
Dual specificity protein kinase TTK
Ligand
BDBM141326
Substrate
Meas. Tech.
Kinase Assay
pH
3±n/a
IC50
1196±n/a nM
Comments
extracted
Citation
 Caldarelli, MCasuscelli, FDonati, DMirizzi, DQuartieri, FSilvagni, M Tricyclic derivatives, process for their preparation and their use as kinase inhibitors US Patent  US8916577 Publication Date 12/23/2014 
Target
Name:
Dual specificity protein kinase TTK
Synonyms:
Dual specificity protein kinase (TTK) MPS1 Monopolar Spindle 1 (MPS1) Monopolar Spindle 1 Kinase (MPS1) TTK | TTK_HUMAN
Type:
Protein
Mol. Mass.:
97086.79
Organism:
Homo sapiens (Human)
Description:
P33981
Residue:
857
  
Inhibitor
Name:
BDBM141326
Synonyms:
US8916577, 67
Type:
Small organic molecule
Emp. Form.:
C23H28N8O
Mol. Mass.:
432.5214
SMILES:
CN1CCN(CC1)c1ccc(Nc2ncc3CCCc4c(nn(C)c4-c3n2)C(N)=O)cc1
: