Target
Vascular endothelial growth factor receptor 2
Ligand
BDBM4889
Substrate
poly(E:Y)
Meas. Tech.
Tyrosine Kinase Assay
pH
7.5±n/a
Temperature
295.15±n/a K
IC50
920±n/a nM
Citation
 Sun, LTran, NLiang, CTang, FRice, ASchreck, RWaltz, KShawver, LKMcMahon, GTang, C Design, synthesis, and evaluations of substituted 3-[(3- or 4-carboxyethylpyrrol-2-yl)methylidenyl]indolin-2-ones as inhibitors of VEGF, FGF, and PDGF receptor tyrosine kinases. J Med Chem 42:5120-30 (1999)  
Target
Name:
Vascular endothelial growth factor receptor 2
Synonyms:
CD_antigen=CD309 Fetal liver kinase 1 (FLK-1) KDR Protein-tyrosine kinase receptor Flk-1 VEGFR-2 VEGFR2 Vascular Endothelial Growth Factor Receptor Kinase 2 Vascular endothelial growth factor receptor 2 (KDR) Vascular endothelial growth factor receptor 2 (VEGFR2) Vascular endothelial growth factor receptor-2 (VEGFR-2)
Type:
Receptor Tyrosine Kinase
Mol. Mass.:
151510.97
Organism:
Homo sapiens (Human)
Description:
P35968
Residue:
1356
  
Inhibitor
Name:
BDBM4889
Synonyms:
3-(4-methyl-5-{[(3Z)-2-oxo-5-sulfamoyl-2,3-dihydro-1H-indol-3-ylidene]methyl}-1H-pyrrol-3-yl)propanoic acid 3-substituted indolin-2-one 11c | SU5402 analog 11c
Type:
Small organic molecule
Emp. Form.:
C17H17N3O5S
Mol. Mass.:
375.399
SMILES:
Cc1c(CCC(O)=O)c[nH]c1\C=C1/C(=O)Nc2ccc(cc12)S(N)(=O)=O
:
Substrate
Name:
poly(E:Y)
Synonyms:
Type:
Random Polymer
Mol. Mass.:
358.43
Organism:
Description:
a polyGlu-Tyr peptide (4:1)(Sigma P-0275). 10 uM ATP as co-substrate.
Residue:
3
NA