Target
Platelet-derived growth factor receptor beta
Ligand
BDBM4889
Substrate
VEGF-receptor 2 and PDGF-receptor beta (KDR and PDGFR beta)
Meas. Tech.
Tyrosine Kinase Assay
IC50
5980±n/a nM
Citation
 Sun, LTran, NLiang, CTang, FRice, ASchreck, RWaltz, KShawver, LKMcMahon, GTang, C Design, synthesis, and evaluations of substituted 3-[(3- or 4-carboxyethylpyrrol-2-yl)methylidenyl]indolin-2-ones as inhibitors of VEGF, FGF, and PDGF receptor tyrosine kinases. J Med Chem 42:5120-30 (1999)  
Target
Name:
Platelet-derived growth factor receptor beta
Synonyms:
Beta-type platelet-derived growth factor receptor CD140b antigen PDGF Receptor Substrate PDGFR PDGFR-1 PDGFRB PGFRB_HUMAN Platelet-derived growth factor receptor 1 Platelet-derived growth factor receptor beta (PDGFR-beta) Platelet-derived growth factor receptor beta (PDGFRbeta) | VHL/PDGFRB
Type:
Enzyme
Mol. Mass.:
123922.25
Organism:
Homo sapiens (Human)
Description:
P09619
Residue:
1106
  
Inhibitor
Name:
BDBM4889
Synonyms:
3-(4-methyl-5-{[(3Z)-2-oxo-5-sulfamoyl-2,3-dihydro-1H-indol-3-ylidene]methyl}-1H-pyrrol-3-yl)propanoic acid 3-substituted indolin-2-one 11c | SU5402 analog 11c
Type:
Small organic molecule
Emp. Form.:
C17H17N3O5S
Mol. Mass.:
375.399
SMILES:
Cc1c(CCC(O)=O)c[nH]c1\C=C1/C(=O)Nc2ccc(cc12)S(N)(=O)=O
:
Substrate
Name:
Platelet-derived growth factor receptor beta
Synonyms:
Beta-type platelet-derived growth factor receptor CD140b antigen PDGF Receptor Substrate PDGFR PDGFR-1 PDGFRB PGFRB_HUMAN Platelet-derived growth factor receptor 1 Platelet-derived growth factor receptor beta (PDGFR-beta) Platelet-derived growth factor receptor beta (PDGFRbeta) | VHL/PDGFRB
Type:
Enzyme
Mol. Mass.:
123922.25
Organism:
Homo sapiens (Human)
Description:
P09619
Residue:
1106