Target
Epidermal growth factor receptor
Ligand
BDBM4889
Substrate
EGF-R Tyrosine Kinase
Meas. Tech.
Tyrosine Kinase Assay
IC50
>100000±n/a nM
Citation
 Sun, LTran, NLiang, CTang, FRice, ASchreck, RWaltz, KShawver, LKMcMahon, GTang, C Design, synthesis, and evaluations of substituted 3-[(3- or 4-carboxyethylpyrrol-2-yl)methylidenyl]indolin-2-ones as inhibitors of VEGF, FGF, and PDGF receptor tyrosine kinases. J Med Chem 42:5120-30 (1999)  
Target
Name:
Epidermal growth factor receptor
Synonyms:
EGF Receptor Substrate EGFR_HUMAN ERBB1 Epidermal Growth Factor Receptor erbB-1 Epidermal growth factor receptor (EGFR) HER1 Proto-oncogene c-ErbB-1 Tyrosine-Protein Kinase ErbB-1
Type:
Receptor Kinase Domain
Mol. Mass.:
134279.59
Organism:
Homo sapiens (Human)
Description:
P00533
Residue:
1210
  
Inhibitor
Name:
BDBM4889
Synonyms:
3-(4-methyl-5-{[(3Z)-2-oxo-5-sulfamoyl-2,3-dihydro-1H-indol-3-ylidene]methyl}-1H-pyrrol-3-yl)propanoic acid 3-substituted indolin-2-one 11c | SU5402 analog 11c
Type:
Small organic molecule
Emp. Form.:
C17H17N3O5S
Mol. Mass.:
375.399
SMILES:
Cc1c(CCC(O)=O)c[nH]c1\C=C1/C(=O)Nc2ccc(cc12)S(N)(=O)=O
:
Substrate
Name:
Epidermal growth factor receptor
Synonyms:
EGF Receptor Substrate EGFR_HUMAN ERBB1 Epidermal Growth Factor Receptor erbB-1 Epidermal growth factor receptor (EGFR) HER1 Proto-oncogene c-ErbB-1 Tyrosine-Protein Kinase ErbB-1
Type:
Receptor Kinase Domain
Mol. Mass.:
134279.59
Organism:
Homo sapiens (Human)
Description:
P00533
Residue:
1210