Target
Integrin alpha-IIb
Ligand
BDBM141990
Substrate
Meas. Tech.
Binding Assay
pH
9.6±n/a
Temperature
277.15±n/a K
IC50
>1000±n/a nM
Comments
extracted
Citation
 Zischinsky, GStragies, ROsterkamp, FScharn, DHummel, GKalkhof, HZahn, GVossmeyer, DChristner-Albrecht, CReineke, U Compounds for the inhibition of integrins and use thereof US Patent  US8927534 Publication Date 1/6/2015 
Target
Name:
Integrin alpha-IIb
Synonyms:
CD_antigen=CD41 GPIIb Glycoprotein IIb ITGA2B Integrin alpha-IIb heavy chain Integrin alpha-IIb light chain, form 2 Integrin alpha-V/beta-3 and alpha-IIb/beta 3 | Platelet membrane glycoprotein IIb
Type:
Protein
Mol. Mass.:
113354.85
Organism:
Homo sapiens (Human)
Description:
P08514
Residue:
1039
  
Inhibitor
Name:
BDBM141990
Synonyms:
US8927534, 266
Type:
Small organic molecule
Emp. Form.:
C32H40N4O3
Mol. Mass.:
528.685
SMILES:
CC(C)C(C(=O)NC(Cc1ccc(cc1)N1CCC(CNc2cc(C)ccn2)CC1)C(O)=O)c1ccccc1
: