Target
Aurora kinase B-B
Ligand
BDBM142744
Substrate
Meas. Tech.
Radioactive Kinase Assay
pH
7.6±n/a
IC50
3±n/a nM
Comments
extracted
Citation
 Zahn, SKSini, PBister, B Anticancer compounds US Patent  US8937095 Publication Date 1/20/2015 
Target
Name:
Aurora kinase B-B
Synonyms:
AUKBB_XENLA airk2-b | aurkb-b
Type:
Protein
Mol. Mass.:
42037.56
Organism:
Xenopus laevis (African clawed frog)
Description:
Q6GPL3
Residue:
368
  
Inhibitor
Name:
BDBM142744
Synonyms:
US8937095, 6
Type:
Small organic molecule
Emp. Form.:
C29H28N4O2
Mol. Mass.:
464.5582
SMILES:
CCNC(=O)C#Cc1ccc2\C(=C(\Nc3ccc(CN(C)C)cc3)c3ccccc3)C(=O)Nc2c1
: