Target
Casein kinase II subunit alpha'
Ligand
BDBM142800
Substrate
Meas. Tech.
Kinase Assay
pH
7.4±n/a
Temperature
303.15±n/a K
IC50
0.64±n/a nM
Comments
extracted
Citation
 Purandare, AVFink, BEGavai, AVJohnson, WLHart, ACHe, LHuynh, TNInghrim, JMastalerz, HSang, XTarby, CMWan, HVaccaro, WZhang, GZhao, YZimmermann, K Imidazotriazinecarbonitriles useful as kinase inhibitors US Patent  US8940736 Publication Date 1/27/2015 
Target
Name:
Casein kinase II subunit alpha'
Synonyms:
CK2A2 CSNK2A2 Casein kinase II alpha' Casein kinase II subunit alpha (CSNK2A2)
Type:
Protein
Mol. Mass.:
41223.82
Organism:
Homo sapiens (Human)
Description:
Residue:
350
  
Inhibitor
Name:
BDBM142800
Synonyms:
US8940736, 184
Type:
Small organic molecule
Emp. Form.:
C28H33ClN12O2
Mol. Mass.:
605.094
SMILES:
CN1CCN(CC(=O)N[C@@H]2CCN(C[C@H]2O)c2cc(cc(Nc3nc(NC4CC4)c4ncc(C#N)n4n3)c2Cl)C#N)CC1
: