Target
Casein kinase II subunit alpha'
Ligand
BDBM142827
Substrate
Meas. Tech.
Kinase Assay
pH
7.4±n/a
Temperature
303.15±n/a K
IC50
0.61±n/a nM
Comments
extracted
Citation
 Purandare, AVFink, BEGavai, AVJohnson, WLHart, ACHe, LHuynh, TNInghrim, JMastalerz, HSang, XTarby, CMWan, HVaccaro, WZhang, GZhao, YZimmermann, K Imidazotriazinecarbonitriles useful as kinase inhibitors US Patent  US8940736 Publication Date 1/27/2015 
Target
Name:
Casein kinase II subunit alpha'
Synonyms:
CK2A2 CSNK2A2 Casein kinase II alpha' Casein kinase II subunit alpha (CSNK2A2)
Type:
Protein
Mol. Mass.:
41223.82
Organism:
Homo sapiens (Human)
Description:
Residue:
350
  
Inhibitor
Name:
BDBM142827
Synonyms:
US8940736, 382
Type:
Small organic molecule
Emp. Form.:
C24H26FN11
Mol. Mass.:
487.5353
SMILES:
CN1CCN(CC1)C1CN(C1)c1cc(cc(Nc2nc(NC3CC3)c3ncc([N+]#[C-])n3n2)c1F)C#N
: