Target
Casein kinase II subunit alpha'
Ligand
BDBM142829
Substrate
Meas. Tech.
Kinase Assay
pH
7.4±n/a
Temperature
303.15±n/a K
IC50
0.03±n/a nM
Comments
extracted
Citation
 Purandare, AVFink, BEGavai, AVJohnson, WLHart, ACHe, LHuynh, TNInghrim, JMastalerz, HSang, XTarby, CMWan, HVaccaro, WZhang, GZhao, YZimmermann, K Imidazotriazinecarbonitriles useful as kinase inhibitors US Patent  US8940736 Publication Date 1/27/2015 
Target
Name:
Casein kinase II subunit alpha'
Synonyms:
CK2A2 CSNK2A2 Casein kinase II alpha' Casein kinase II subunit alpha (CSNK2A2)
Type:
Protein
Mol. Mass.:
41223.82
Organism:
Homo sapiens (Human)
Description:
Residue:
350
  
Inhibitor
Name:
BDBM142829
Synonyms:
US8940736, 391
Type:
Small organic molecule
Emp. Form.:
C19H15N13
Mol. Mass.:
425.4095
SMILES:
Cc1nc(Nc2nc(Nc3ccc4n(C)nc(C#N)c4c3)nn3c(cnc23)[N+]#[C-])nn1C
: