Target
E3 ubiquitin-protein ligase Mdm2
Ligand
BDBM143676
Substrate
Meas. Tech.
Time Resolved Fluorescence Energy Transfer (TR-FRET) Assay
IC50
0.097±n/a nM
Citation
 Furet, PGuagnano, VHolzer, PMah, RMasuya, KSchlapbach, AStutz, SVaupel, A Pyrazolopyrrolidine compounds US Patent  US8969341 Publication Date 3/3/2015 
Target
Name:
E3 ubiquitin-protein ligase Mdm2
Synonyms:
Double minute 2 protein E3 ubiquitin-protein ligase Mdm2 (p53-binding protein Mdm2) Human Double Minute 2 (HDM2) MDM2-MDMX p53-Binding Protein MDM2 | p53-binding protein
Type:
Oncoprotein
Mol. Mass.:
55196.54
Organism:
Homo sapiens (Human)
Description:
Q00987
Residue:
491
  
Inhibitor
Name:
BDBM143676
Synonyms:
US8969341, 183
Type:
Small organic molecule
Emp. Form.:
C27H25ClN8O3
Mol. Mass.:
544.992
SMILES:
COc1nc(ncc1-n1nc2C(=O)N([C@H](c2c1C(C)C)c1ccc(cc1)C#N)c1cc(Cl)c[nH]c1=O)N(C)C
: