Target
Prostaglandin E2 receptor EP4 subtype
Ligand
BDBM144430
Substrate
Meas. Tech.
Binding Assay
pH
6±n/a
Temperature
298.15±n/a K
Ki
5.2±n/a nM
Comments
extracted
Citation
 Blouin, MBurch, JHan, YMellon, C Thiophenecarboxamide derivatives as EP4 receptor ligands US Patent  US8969394 Publication Date 3/3/2015 
Target
Name:
Prostaglandin E2 receptor EP4 subtype
Synonyms:
PE2R4_HUMAN PGE2 receptor EP4 subtype PTGER4 Prostanoid EP4 receptor
Type:
Enzyme
Mol. Mass.:
53134.53
Organism:
Homo sapiens (Human)
Description:
P35408
Residue:
488
  
Inhibitor
Name:
BDBM144430
Synonyms:
US8969394, 1
Type:
Small organic molecule
Emp. Form.:
C21H17Cl2NO3S
Mol. Mass.:
434.336
SMILES:
CC(NC(=O)c1sc(Cl)cc1Cc1cccc(Cl)c1)c1ccc(cc1)C(O)=O
: