Target
Prostaglandin E2 receptor EP4 subtype
Ligand
BDBM144444
Substrate
Meas. Tech.
Binding Assay
pH
6±n/a
Temperature
298.15±n/a K
Ki
133±n/a nM
Comments
extracted
Citation
 Blouin, MBurch, JHan, YMellon, C Thiophenecarboxamide derivatives as EP4 receptor ligands US Patent  US8969394 Publication Date 3/3/2015 
Target
Name:
Prostaglandin E2 receptor EP4 subtype
Synonyms:
PE2R4_HUMAN PGE2 receptor EP4 subtype PTGER4 Prostanoid EP4 receptor
Type:
Enzyme
Mol. Mass.:
53134.53
Organism:
Homo sapiens (Human)
Description:
P35408
Residue:
488
  
Inhibitor
Name:
BDBM144444
Synonyms:
US8969394, 19
Type:
Small organic molecule
Emp. Form.:
C30H27F3N2O4S2
Mol. Mass.:
600.672
SMILES:
C[C@H](NC(=O)c1c(C)sc(C)c1Cc1ccc(cc1)C(F)(F)F)c1ccc(cc1)C(=O)NS(=O)(=O)c1ccccc1
: