Target
Apoptosis regulator Bcl-2
Ligand
BDBM144820
Substrate
Meas. Tech.
Time Resolved-Fluorescence Resonance Energy Transfer (TR-FRET) Assay
Temperature
298.15±n/a K
Ki
8.354±n/a nM
Comments
extracted
Citation
 Ding, HDoherty, GAElmore, SWHexamer, LKunzer, ARPark, CSong, XSouers, AJSullivan, GMTao, ZWang, LWendt, MDCzabotar, PELessene, GLColman, PM Apoptosis-inducing agents for the treatment of cancer and immune and autoimmune diseases US Patent  US8952157 Publication Date 2/10/2015 
Target
Name:
Apoptosis regulator Bcl-2
Synonyms:
Apoptosis regulator Bcl-2 Protein BCL-2 BCL2_HUMAN | Bcl-2 Protein
Type:
Homodimer or heterodimer
Mol. Mass.:
26269.11
Organism:
Homo sapiens (Human)
Description:
P10415
Residue:
239
  
Inhibitor
Name:
BDBM144820
Synonyms:
US8952157, 1 | US9303025, 1
Type:
Small organic molecule
Emp. Form.:
C45H49ClN6O7S
Mol. Mass.:
853.425
SMILES:
CN(C)Cc1cccc(Oc2cc(ccc2C(=O)NS(=O)(=O)c2ccc(NCC3CCOCC3)c(c2)[N+]([O-])=O)N2CCN(Cc3ccccc3-c3ccc(Cl)cc3)CC2)c1
: