Target
Tyrosine-protein kinase JAK2
Ligand
BDBM147482
Substrate
Meas. Tech.
HTRF Assay
IC50
>1500±n/a nM
Citation
 Brubaker, JDinsmore, CHoffman, DMJung, JLiu, DPeterson, SSiu, TTorres, LEZhang, HWei, ZShi, F Cycloalkylnitrile pyrazole carboxamides as janus kinase inhibitors US Patent  US8962608 Publication Date 2/24/2015 
Target
Name:
Tyrosine-protein kinase JAK2
Synonyms:
JAK-2 JAK2_HUMAN Janus kinase 2 (JAK2) | Janus kinase 2 (a protein tyrosine kinase)
Type:
Protein
Mol. Mass.:
130684.68
Organism:
Homo sapiens (Human)
Description:
O60674
Residue:
1132
  
Inhibitor
Name:
BDBM147482
Synonyms:
US8962608, 2-5
Type:
Small organic molecule
Emp. Form.:
C17H19N5O2
Mol. Mass.:
325.3651
SMILES:
NC(=O)c1cn(nc1Nc1ccccc1)C1[C@H](O)CCC[C@H]1C#N
: