Target
E3 ubiquitin-protein ligase Mdm2
Ligand
BDBM148142
Substrate
Meas. Tech.
FRET Assay
IC50
1±n/a nM
Citation
 Christopher, MPFradera Llinas, FXMachacek, MMartinez, MReutershan, MHShizuka, MSun, BThompson, CFTrotter, BWVoss, MEAltman, MDBogen, SLDoll, RJ Substituted imidazopyridines as HDM2 inhibitors US Patent  US8962611 Publication Date 2/24/2015 
Target
Name:
E3 ubiquitin-protein ligase Mdm2
Synonyms:
Double minute 2 protein E3 ubiquitin-protein ligase Mdm2 (p53-binding protein Mdm2) Human Double Minute 2 (HDM2) MDM2-MDMX p53-Binding Protein MDM2 | p53-binding protein
Type:
Oncoprotein
Mol. Mass.:
55196.54
Organism:
Homo sapiens (Human)
Description:
Q00987
Residue:
491
  
Inhibitor
Name:
BDBM148142
Synonyms:
US8962611, 3.91
Type:
Small organic molecule
Emp. Form.:
C28H34ClN7O3
Mol. Mass.:
552.068
SMILES:
CC(C)[C@@H]1C[C@@H](O)CN1c1nc2cc(nc(-c3cncc(Cl)c3)c2n1C[C@H]1CC[C@H](C)CC1)-c1noc(=O)[nH]1
: