Target
Oligo-1,6-glucosidase IMA1
Ligand
BDBM67523
Substrate
Meas. Tech.
Alpha-glucosidase Inhibition Assay
Temperature
310.15±0 K
IC50
4.5832e+5± 1.14e+3 nM
Citation
 Yar, MBajda, MShahzad, SUllah, NGilani, MAAshraf, MRauf, AShaukat, A Organocatalyzed solvent free an efficient novel synthesis of 2,4,5-trisubstituted imidazoles for a-glucosidase inhibition to treat diabetes. Bioorg Chem 58:65-71 (2015)  
Target
Name:
Oligo-1,6-glucosidase IMA1
Synonyms:
α-glucosidase Alpha-glucosidase (α-glucosidase) MALX3_YEAST | Oligo-1,6-glucosidase
Type:
Protein
Mol. Mass.:
68577.59
Organism:
Saccharomyces cerevisiae S288c (Baker's yeast)
Description:
Residue:
589
  
Inhibitor
Name:
BDBM67523
Synonyms:
2-(4-chlorophenyl)-4,5-diphenyl-1H-imidazole cid_794727
Type:
Small organic molecule
Emp. Form.:
C21H15ClN2
Mol. Mass.:
330.81
SMILES:
Clc1ccc(cc1)-c1nc(c([nH]1)-c1ccccc1)-c1ccccc1
: