Target
Amine oxidase [flavin-containing] A
Ligand
BDBM50011446
Substrate
Meas. Tech.
Fluorimetric Assay
Ki
5.06e+3± 2.1e+2 nM
Citation
 Nayak, BVCiftci-Yabanoglu, SBhakat, STimiri, AKSinha, BNUcar, GSoliman, MEJayaprakash, V Monoamine oxidase inhibitory activity of 2-aryl-4H-chromen-4-ones. Bioorg Chem 58:72-80 (2015)  
Target
Name:
Amine oxidase [flavin-containing] A
Synonyms:
AOFA_HUMAN MAO-A Monoamine oxidase Monoamine oxidase type A (MAO A) Monoamine oxidase type A (MAOA)
Type:
Protein
Mol. Mass.:
59689.53
Organism:
Homo sapiens (Human)
Description:
P21397
Residue:
527
  
Inhibitor
Name:
BDBM50011446
Synonyms:
2-(4-Hydroxy-phenyl)-chromen-4-one 4'-hydroxyflavone NSC-22357
Type:
Small organic molecule
Emp. Form.:
C15H10O3
Mol. Mass.:
238.2381
SMILES:
Oc1ccc(cc1)-c1cc(=O)c2ccccc2o1
: