Target
Amine oxidase [flavin-containing] B
Ligand
BDBM50011446
Substrate
Meas. Tech.
Fluorimetric Assay
Ki
1.05e+3± 9e+1 nM
Citation
 Nayak, BVCiftci-Yabanoglu, SBhakat, STimiri, AKSinha, BNUcar, GSoliman, MEJayaprakash, V Monoamine oxidase inhibitory activity of 2-aryl-4H-chromen-4-ones. Bioorg Chem 58:72-80 (2015)  
Target
Name:
Amine oxidase [flavin-containing] B
Synonyms:
AOFB_HUMAN MAOB Monoamine oxidase type B (MAO B) Monoamine oxidase type B (MAOB)
Type:
Protein
Mol. Mass.:
58768.76
Organism:
Homo sapiens (Human)
Description:
P27338
Residue:
520
  
Inhibitor
Name:
BDBM50011446
Synonyms:
2-(4-Hydroxy-phenyl)-chromen-4-one 4'-hydroxyflavone NSC-22357
Type:
Small organic molecule
Emp. Form.:
C15H10O3
Mol. Mass.:
238.2381
SMILES:
Oc1ccc(cc1)-c1cc(=O)c2ccccc2o1
: