Target
Transient receptor potential cation channel subfamily M member 8
Ligand
BDBM151758
Substrate
Meas. Tech.
Inhibition Assay
Temperature
310.15±n/a K
IC50
1.3±n/a nM
Comments
extracted
Citation
 Tsuzuki, YSawamoto, DSakamoto, TKato, TNiwa, YAwai, N Sulfonamide compounds having TRPM8 antagonistic activity US Patent  US8987445 Publication Date 3/24/2015 
Target
Name:
Transient receptor potential cation channel subfamily M member 8
Synonyms:
LTRPC6 TRPM8_HUMAN Transient receptor potential M8 protein (TRPM8) Transient receptor potential cation channel subfamily M member 8 (TRPM8)
Type:
Enzyme
Mol. Mass.:
127693.26
Organism:
Homo sapiens (Human)
Description:
Q7Z2W7
Residue:
1104
  
Inhibitor
Name:
BDBM151758
Synonyms:
US8987445, 194
Type:
Small organic molecule
Emp. Form.:
C26H18F2N2O4S2
Mol. Mass.:
524.559
SMILES:
Cc1c(ncc2ccccc12)N(Cc1cc2c(F)cc(F)cc2s1)S(=O)(=O)c1ccc(cc1)C(O)=O
: