Target
Transient receptor potential cation channel subfamily M member 8
Ligand
BDBM151797
Substrate
Meas. Tech.
Inhibition Assay
Temperature
310.15±n/a K
IC50
0.9±n/a nM
Comments
extracted
Citation
 Tsuzuki, YSawamoto, DSakamoto, TKato, TNiwa, YAwai, N Sulfonamide compounds having TRPM8 antagonistic activity US Patent  US8987445 Publication Date 3/24/2015 
Target
Name:
Transient receptor potential cation channel subfamily M member 8
Synonyms:
LTRPC6 TRPM8_HUMAN Transient receptor potential M8 protein (TRPM8) Transient receptor potential cation channel subfamily M member 8 (TRPM8)
Type:
Enzyme
Mol. Mass.:
127693.26
Organism:
Homo sapiens (Human)
Description:
Q7Z2W7
Residue:
1104
  
Inhibitor
Name:
BDBM151797
Synonyms:
US8987445, 233
Type:
Small organic molecule
Emp. Form.:
C28H19ClF5N2NaO4S
Mol. Mass.:
632.961
SMILES:
FC(F)(F)c1c(ncc2ccccc12)N(Cc1ccc(c(Cl)c1)C(F)(F)C1CC1)S(=O)(=O)c1ccc(cc1)C(=O)O[Na]
: