Target
Serine/threonine-protein kinase pim-1
Ligand
BDBM151965
Substrate
Meas. Tech.
AlphaScreen Assay
IC50
0.02±n/a nM
Citation
 Burger, MDrumm, III, JENishiguchi, GRico, ASimmons, RLTaft, BTanner, H Ring-substituted N-pyridinyl amides as kinase inhibitors US Patent  US8987457 Publication Date 3/24/2015 
Target
Name:
Serine/threonine-protein kinase pim-1
Synonyms:
PIM-1 Kinase PIM1_HUMAN Serine/threonine-protein kinase (PIM1) Serine/threonine-protein kinase PIM1 | Serine/threonine-protein kinase pim-1 (PIM1)
Type:
Protein
Mol. Mass.:
35681.82
Organism:
Homo sapiens (Human)
Description:
P11309
Residue:
313
  
Inhibitor
Name:
BDBM151965
Synonyms:
US8987457, 159
Type:
Small organic molecule
Emp. Form.:
C30H33F3N6O5
Mol. Mass.:
614.6154
SMILES:
COC(=O)N[C@H]1[C@@H](C)CN(C[C@H]1N)c1ccncc1NC(=O)c1ccc(F)c(n1)-c1c(F)cc(OC2CCOCC2)cc1F
: