Target
Receptor-type tyrosine-protein phosphatase eta
Ligand
BDBM152210
Substrate
Meas. Tech.
Inhibition Assay
IC50
65617±n/a nM
Citation
 Wu, JLawrence, NJSebti, SMLawrence, HR Inhibition of Shp2/PTPN11 protein tyrosine phosphatase by NSC-87877, NSC-117199 and their analogs US Patent  US8987474 Publication Date 3/24/2015 
Target
Name:
Receptor-type tyrosine-protein phosphatase eta
Synonyms:
DEP1 PTPRJ Protein-tyrosine phosphatase Receptor-type tyrosine-protein phosphatase eta (DEP1)
Type:
Protein
Mol. Mass.:
145920.57
Organism:
Homo sapiens (Human)
Description:
Q12913
Residue:
1337
  
Inhibitor
Name:
BDBM152210
Synonyms:
US8987474, NSC-87877
Type:
Small organic molecule
Emp. Form.:
C19H13N3O7S2
Mol. Mass.:
459.452
SMILES:
Oc1c(cc(c2cccnc12)S(O)(=O)=O)N=Nc1ccc2cc(ccc2c1)S(O)(=O)=O
: