Target
Amine oxidase [flavin-containing] B
Ligand
BDBM152634
Substrate
Meas. Tech.
Amplex Red MAO Assay
pH
7.4±n/a
Ki
3.5e+2± 2e+1 nM
Comments
extracted
Citation
 Mathew, BMathew, GEUçar, GBaysal, ISuresh, JVilapurathu, JKPrakasan, ASuresh, JKThomas, A Development of fluorinated methoxylated chalcones as selective monoamine oxidase-B inhibitors: Synthesis, biochemistry and molecular docking studies. Bioorg Chem 62:22-29 (2015)  
Target
Name:
Amine oxidase [flavin-containing] B
Synonyms:
AOFB_HUMAN MAOB Monoamine oxidase type B (MAO B) Monoamine oxidase type B (MAOB)
Type:
Protein
Mol. Mass.:
58768.76
Organism:
Homo sapiens (Human)
Description:
P27338
Residue:
520
  
Inhibitor
Name:
BDBM152634
Synonyms:
(2E)-3-(3-fluorophenyl)-1-(4-methoxyphenyl)prop-2-en-1-one (M2)
Type:
Small organic molecule
Emp. Form.:
C16H13FO2
Mol. Mass.:
256.2716
SMILES:
COc1ccc(cc1)C(=O)\C=C\c1cccc(F)c1
: