Target
Amine oxidase [flavin-containing] B
Ligand
BDBM152637
Substrate
Meas. Tech.
Amplex Red MAO Assay
pH
7.4±n/a
Ki
2.2e+2± 1e+1 nM
Comments
extracted
Citation
 Mathew, BMathew, GEUçar, GBaysal, ISuresh, JVilapurathu, JKPrakasan, ASuresh, JKThomas, A Development of fluorinated methoxylated chalcones as selective monoamine oxidase-B inhibitors: Synthesis, biochemistry and molecular docking studies. Bioorg Chem 62:22-29 (2015)  
Target
Name:
Amine oxidase [flavin-containing] B
Synonyms:
AOFB_HUMAN MAOB Monoamine oxidase type B (MAO B) Monoamine oxidase type B (MAOB)
Type:
Protein
Mol. Mass.:
58768.76
Organism:
Homo sapiens (Human)
Description:
P27338
Residue:
520
  
Inhibitor
Name:
BDBM152637
Synonyms:
(2E)-1-(4-methoxyphenyl)-3-[4-(trifluoromethyl)phenyl]prop-2-en-1-one (M5)
Type:
Small organic molecule
Emp. Form.:
C17H13F3O2
Mol. Mass.:
306.2791
SMILES:
COc1ccc(cc1)C(=O)\C=C\c1ccc(cc1)C(F)(F)F
: