Target
Amine oxidase [flavin-containing] B
Ligand
BDBM15613
Substrate
Meas. Tech.
Amplex Red MAO Assay
pH
7.4±n/a
Ki
1.45e+3± 4e+1 nM
Comments
extracted
Citation
 Mathew, BMathew, GEUçar, GBaysal, ISuresh, JVilapurathu, JKPrakasan, ASuresh, JKThomas, A Development of fluorinated methoxylated chalcones as selective monoamine oxidase-B inhibitors: Synthesis, biochemistry and molecular docking studies. Bioorg Chem 62:22-29 (2015)  
Target
Name:
Amine oxidase [flavin-containing] B
Synonyms:
AOFB_HUMAN MAOB Monoamine oxidase type B (MAO B) Monoamine oxidase type B (MAOB)
Type:
Protein
Mol. Mass.:
58768.76
Organism:
Homo sapiens (Human)
Description:
P27338
Residue:
520
  
Inhibitor
Name:
BDBM15613
Synonyms:
4-chloro-N-(2-morpholin-4-ylethyl)benzamide Aurorix MCL | Moclobemide
Type:
Small organic molecule
Emp. Form.:
C13H17ClN2O2
Mol. Mass.:
268.739
SMILES:
Clc1ccc(cc1)C(=O)NCCN1CCOCC1
: