Target
Ribosyldihydronicotinamide dehydrogenase [quinone]
Ligand
BDBM11323
Substrate
Meas. Tech.
Fluorescence Titration Assay
Kd
7.11e+3± 4e+1 nM
Citation
 Leung, KKShilton, BH Quinone reductase 2 is an adventitious target of protein kinase CK2 inhibitors TBBz (TBI) and DMAT. Biochemistry 54:47-59 (2015)  
Target
Name:
Ribosyldihydronicotinamide dehydrogenase [quinone]
Synonyms:
Metallothionein-3 NQO2 NRH dehydrogenase [quinone] 2 QR2 Quinone reductase 2 (NQO2) | Ribosyldihydronicotinamide dehydrogenase [quinone]
Type:
Protein
Mol. Mass.:
25917.25
Organism:
Homo sapiens (Human)
Description:
P16083
Residue:
231
  
Inhibitor
Name:
BDBM11323
Synonyms:
4,5,6,7-tetrabromo-1H-1,2,3-benzotriazole CHEMBL177820 | TBB
Type:
Small organic molecule
Emp. Form.:
C6HBr4N3
Mol. Mass.:
434.708
SMILES:
Brc1c(Br)c(Br)c2[nH]nnc2c1Br
: