Target
Ribosyldihydronicotinamide dehydrogenase [quinone]
Ligand
BDBM50156670
Substrate
Meas. Tech.
Inhibition of Steady-State Catalysis Assay
IC50
484±80 nM
Citation
 Leung, KKShilton, BH Quinone reductase 2 is an adventitious target of protein kinase CK2 inhibitors TBBz (TBI) and DMAT. Biochemistry 54:47-59 (2015)  
Target
Name:
Ribosyldihydronicotinamide dehydrogenase [quinone]
Synonyms:
Metallothionein-3 NQO2 NRH dehydrogenase [quinone] 2 QR2 Quinone reductase 2 (NQO2) | Ribosyldihydronicotinamide dehydrogenase [quinone]
Type:
Protein
Mol. Mass.:
25917.25
Organism:
Homo sapiens (Human)
Description:
P16083
Residue:
231
  
Inhibitor
Name:
BDBM50156670
Synonyms:
2-(dimethylamino)-4,5,6,7-tetrabromo-1H-benzimidazole CHEMBL376505
Type:
Small organic molecule
Emp. Form.:
C9H7Br4N3
Mol. Mass.:
476.788
SMILES:
CN(C)c1nc2c(Br)c(Br)c(Br)c(Br)c2[nH]1
: