Target
Hemagglutinin
Ligand
BDBM5019
Substrate
BDBM4702
Meas. Tech.
Neuraminidase Inhibition Assay
pH
6.5±n/a
Temperature
310.15±n/a K
IC50
43±11 nM
Citation
 Chand, PKotian, PLDehghani, AEl-Kattan, YLin, THHutchison, TLBabu, YSBantia, SElliott, AJMontgomery, JA Systematic structure-based design and stereoselective synthesis of novel multisubstituted cyclopentane derivatives with potent antiinfluenza activity. J Med Chem 44:4379-92 (2001)  
Target
Name:
Hemagglutinin
Synonyms:
Influenza B Virus Neuraminidase | Neuraminidase B
Type:
Enzyme
Mol. Mass.:
37412.70
Organism:
Influenza B virus (B/Victoria/70)
Description:
Q9QMU3
Residue:
346
  
Inhibitor
Name:
BDBM5019
Synonyms:
(3R*,4R*)-3-[(1S*)-1-(Acetylamino)pentyl]-4-{[amino (imino)methyl]amino}cyclopentanecarboxylic Acid Cyclopentane Derivative 27b
Type:
Small organic molecule
Emp. Form.:
C14H26N4O3
Mol. Mass.:
298.3812
SMILES:
[H][C@@](CCCC)(NC(C)=O)[C@@H]1CC(C[C@H]1N=C(N)N)C(O)=O
:
Substrate
Name:
BDBM4702
Synonyms:
(2R,4S,5R,6R)-5-acetamido-4-hydroxy-2-[(4-methyl-2-oxo-2H-chromen-7-yl)oxy]-6-[(1R,2R)-1,2,3-trihydroxypropyl]oxane-2-carboxylic acid neuraminidase substrate
Type:
Small organic molecule
Emp. Form.:
C21H25NO11
Mol. Mass.:
467.4233
SMILES:
CC(=O)N[C@@H]1[C@@H](O)C[C@](Oc2ccc3c(C)cc(=O)oc3c2)(O[C@H]1[C@H](O)[C@H](O)CO)C(O)=O
: