Target
Phospholipase A2 group V
Ligand
BDBM18207
Substrate
Meas. Tech.
sPLA2V Activity Assay
pH
7.5±n/a
Temperature
298.15±n/a K
IC50
6.2e+2± 9e+1 nM
Comments
extracted
Citation
 Bukhari, SNZhang, XJantan, IZhu, HLAmjad, MWMasand, VH Synthesis, Molecular Modeling, and Biological Evaluation of Novel 1, 3-Diphenyl-2-propen-1-one Based Pyrazolines as Anti-inflammatory Agents. Chem Biol Drug Des 85:729-42 (2015)  
Target
Name:
Phospholipase A2 group V
Synonyms:
PA2G5_HUMAN Phospholipase A2 group V | Secretory phospholipase A2, group V (sPLA2-V)
Type:
Protein
Mol. Mass.:
15682.61
Organism:
Homo sapiens (Human)
Description:
Residue:
138
  
Inhibitor
Name:
BDBM18207
Synonyms:
(1R,2S,10S,11S,13R,14R,15S,17S)-1-fluoro-14,17-dihydroxy-14-(2-hydroxyacetyl)-2,13,15-trimethyltetracyclo[8.7.0.0^{2,7}.0^{11,15}]heptadeca-3,6-dien-5-one US11554172, Compound Dexamethasone dexamethasone (tetramethyl-rhodamine conjugated )
Type:
Steroid
Emp. Form.:
C22H29FO5
Mol. Mass.:
392.4611
SMILES:
[H][C@@]12C[C@@H](C)[C@](O)(C(=O)CO)[C@@]1(C)C[C@H](O)[C@@]1(F)[C@@]2([H])CCC2=CC(=O)C=C[C@]12C
: