Target
Epithelial discoidin domain-containing receptor 1
Ligand
BDBM286871
Substrate
Meas. Tech.
Binding Activity
Temperature
298.15±n/a K
IC50
410±n/a nM
Comments
extracted
Citation
 Murata, TKawada, HNiizuma, SHara, SHada, KShimada, HTanaka, HMio, T Quinazolinedione derivative US Patent  US9567304 Publication Date 2/14/2017 
Target
Name:
Epithelial discoidin domain-containing receptor 1
Synonyms:
CAK DDR1_HUMAN Discoidin domain-containing receptor 1 (DDR1) EDDR1 Epithelial discoidin domain receptor 1 (DDR1) Epithelial discoidin domain-containing receptor 1 (DDR1) Mammary carcinoma kinase 10 NTRK4 Protein-tyrosine kinase RTK 6 TRKE | Tyrosine-protein kinase CAK
Type:
Tyrosine-protein kinase
Mol. Mass.:
101130.02
Organism:
Homo sapiens (Human)
Description:
Q08345
Residue:
913
  
Inhibitor
Name:
BDBM286871
Synonyms:
(S)-1-[8-Chloro-3-(5- chloro-2-ethanesulfonyl- benzyl)-2,4-dioxo-6- trifluoromethyl-1,2,3,4- tetrahydro-quinazolin-7- ylmethyl]-pyrrolidine-2- carboxylic acid methylamide | US9567304, Compound F-146
Type:
Small organic molecule
Emp. Form.:
C25H25Cl2F3N4O5S
Mol. Mass.:
621.456
SMILES:
CCS(=O)(=O)c1ccc(Cl)cc1Cn1c(=O)[nH]c2c(Cl)c(CN3CCC[C@H]3C(=O)NC)c(cc2c1=O)C(F)(F)F
: