Target
Decaprenyl diphosphate synthase
Ligand
BDBM153358
Substrate
Meas. Tech.
DPPS Inhibition (trans FPP based) Assay
pH
7.5±n/a
IC50
1.13e+5±n/a nM
Comments
extracted
Citation
 Kim, MOFeng, XFeixas, FZhu, WLindert, SBogue, SSinko, Wde Oliveira, CRao, GOldfield, EMcCammon, JA A Molecular Dynamics Investigation of Mycobacterium tuberculosis Prenyl Synthases: Conformational Flexibility and Implications for Computer-aided Drug Discovery. Chem Biol Drug Des 85:756-69 (2015)  
Target
Name:
Decaprenyl diphosphate synthase
Synonyms:
DPDS_MYCTO uppS
Type:
Protein
Mol. Mass.:
33800.02
Organism:
Mycobacterium tuberculosis H37Rv
Description:
Residue:
296
  
Inhibitor
Name:
BDBM153358
Synonyms:
BPH-652
Type:
Small organic molecule
Emp. Form.:
C16H19O7PS
Mol. Mass.:
386.357
SMILES:
OP(O)(=O)C(CCCc1cccc(Oc2ccccc2)c1)S(O)(=O)=O
: